{"text_format":"1","workbook":"xlsx","n_sheets":8,"sheets":["Main Form","Instructions","Positions","Add Employees","Modify Employees","Employment Tracking Form","Ranges","Sheet1"],"not_rendered":{"charts":0,"images":16,"macros":1,"external_links":0,"defined_names":29,"comments":0,"pivot_tables":0},"unopened":[],"bounds":{"document_bytes":16777216,"sheet_cells":100000,"rows_first":2000,"rows_last":500,"rows_between":2000,"halvings":0,"cell_chars":16384,"cell_head_chars":4096},"cells_cut":0,"cells_raw":0,"read":"whole","date_system":"1900"}

{"sheet":"Main Form","index":0,"n_rows":31,"n_cols":3,"rows_kept":31,"cut":false,"hidden":false,"merged":[]}
["Employment Tracking and Direct Benefit File"]
[]
[]
["Before starting, please complete the following:"]
[]
["Date of Award (MM/DD/YYYY):"]
["Name of local government:"]
["Name of assisted entity/business:"]
["DUNS number for the business:"]
["NAIC code:"]
["Does the business provide healthcare benefits?:",null,"Yes or No"]
["CDBG contract #:  "]
["Employees on staff at project start:"]
["LMI Employees on staff at project start:",null,"For retention projects."]
[]
[]
[]
["Go To:"]
[]
[null,"Instructions for using this tool.","Modify existing employees.  For example,"]
[null,null,"wage, hours worked per week, etc."]
[]
[]
[null,"Define the employment positions for the assisted","This is the report that will be provided to"]
[null,"company.","the CDBG-ED program assistant or specialist."]
[]
[]
[]
[null,"Add staff to the report.  This sheet is only used for "]
[null,"the addition of new staff or to define those who were"]
[null,"employed at the date of award."]

{"sheet":"Instructions","index":1,"n_rows":324,"n_cols":6,"rows_kept":324,"cut":false,"hidden":false,"merged":[]}
["Montana Department of Commerce"]
["CDBG-ED Employment Tracking Form"]
[]
[]
["General Rules:"]
["The employee roster at the time of the date of award must be added to the tool and submitted to MDOC."]
["*","For non-retention projects, the starting roster does not need to include income or racial survey"]
[null,"results."]
[]
["For every reporting period thereafter, the administrator must:"]
["*","Modify records for employees who have changed jobs or been terminated."]
["*","Add records for employees who have been hired."]
["*","Send a copy of the report, electronically, to MDOC following the instructions provided below."]
[]
["There should only be one record per employee.  The only exception is if an employee is hired, then"]
[null,"terminated, then rehired.  In situations such as this, there should be one record for the initial"]
[null,"hire and then the employee record is modified by adding the termination date.  When the employee"]
[null,"is rehired a new record is then added.  Seasonal employees should be handled in this manner."]
[]
["Please read the instructions which follow:"]
[]
["The automation of this process is intended to make the capture of employee data intuitive for the user."]
["In addition, to provide results that are consistent with what the MDOC CDBG-ED group needs, in order to"]
["comply with Federal HUD regulations."]
[]
["The Excel file should be saved to a single directory, and the same file should be used throughout the reporting"]
["time period for the project it relates to (thereby making it a cumulative report)."]
[]
["If you find any issues with this tool, please report them to the CDBG-ED program specialist in Helena to "]
["be addressed."]
[]
["To start with:"]
[]
["First we need to make sure the embedded code works.  How you do this depends on what version of Excel you"]
["are using."]
["In Office 2003, you immediately are prompted when opening the tool whether you would like to enable macros"]
["to run.  Please click the enable macros button."]
[]
["In version 2003 and prior you can also:"]
[]
[null,"Set your Macro Security Setting to 'Medium'."]
[]
[null,"From the toolbar, select"]
[null,"Tools', then 'Options'."]
[]
[]
[]
[]
[]
[]
[]
[]
[]
[]
[]
[]
[]
[]
[]
["From 'Options', select 'Security'.  ",null,null,null,null,"From 'Macro Security' set your level to"]
["From 'Security' select 'Macro Security'.",null,null,null,null,"medium.  This will give you the option"]
[null,null,null,null,null,"to allow macros to run (you'll need them to "]
[null,null,null,null,null,"use this tool)."]
[]
[]
[]
[]
["For Excel 2007:"]
[]
["Below the ribbon on the left hand side, you should see a security warning each time you open the file."]
[]
[]
[]
[]
[]
[]
[]
[]
["If you don't see this warning, click the 'View' Tab "]
["and make sure 'Message Bar' is is checked (making"]
["it visible)."]
[]
[]
[]
[]
[]
["However, if you still do not see the security warning, click the down arrow(s) on the on the"]
["right side of the formula bar."]
[]
[]
[]
[]
[]
[]
[]
[]
["When you see the security warning, click the 'Options' button (as seen above).  Then click"]
["the button to the left of 'Enable this content', in the security options dialogue box."]
[]
[]
[]
[]
[]
[]
[]
[]
[]
[]
[]
[]
[]
[]
[]
[]
[]
[]
[]
[]
[]
[]
{"$rows_left_out":205}
{"sheet":"Positions","index":2,"n_rows":525,"n_cols":4,"rows_kept":525,"cut":false,"hidden":false,"merged":[]}
[]
[]
[]
[null,"Position List"]
[null,"Salesperson",null,"To correctly monitor staffing, we need to understand the employment positions "]
[null,"Data Entry",null,"that make up the business entity."]
[null,"Bookkeeper"]
[null,"Head Sawyer",null,"The positions listed to the left are only examples. They are intended to provide an"]
[null,"Log Peeler",null,"an example of what we are looking for."]
[null,"Machine Operator"]
[null,"Plant Manager",null,"Please erase them and enter in the positions that are applicable to your organization."]
[null,"Maintenance Specialist",null,"Start at the top and do not leave spaces between positions."]
[null,"Machine Operator"]
[null,"Receptionist",null,"Every quarter add any new positions to this list."]
[null,"Draftsman"]
[null,"Vice President"]
[]
[null,null,null,"This list does not need to be printed and sent to the Department."]
[]
[]
[]
[]
[]
[]
[]
[]
[]
[]
[]
[]
[]
[]
[]
[]
[]
[]
[]
[]
[]
[]
[]
[]
[]
[]
[]
[]
[]
[]
[]
[]
[]
[]
[]
[]
[]
[]
[]
[]
[]
[]
[]
[]
[]
[]
[]
[]
[]
[]
[]
[]
[]
[]
[]
[]
[]
[]
[]
[]
[]
[]
[]
[]
[]
[]
[]
[]
[]
[]
[]
[]
[]
[]
[]
[]
[]
[]
[]
[]
[]
[]
[]
[]
[]
[]
[]
[]
[]
[]
[]
[]
[]
[]
[]
[]
[]
[]
[]
[]
[]
[]
{"$rows_left_out":406}
{"sheet":"Add Employees","index":3,"n_rows":36,"n_cols":25,"rows_kept":36,"cut":false,"hidden":false,"merged":[]}
["Montana Department of Commerce",null,null,null,null,null,null,null,null,null,null,{"$f":"AND(C5<>\"\",C7<>\"\",C9<>\"\",C11<>\"\",C13<>\"\",C15<>\"\",C17<>\"\",C20<>\"\",C23<>\"\",C25<>\"\",C27<>\"\",C30<>\"\",C33<>\"\",C36<>\"\")","v":false}]
["CDBG-ED Employment Tracking Form"]
["Employee Addition Sheet",null,"Please complete all entries in this column."]
[null,null,"Use the drop down box when available."]
[null,"First Name",null,null,null,null,null,null,null,null,null,"EMPLOYEE NAME","EMPLOYEE POSITION NUMBER","JOB CODE (Key #1)","HIRE STATUS (Key #2)","DATE HIRED","DATE TERMINATED","FT / PT (Key #3)","FTE %              ie. .5, .75, 1.0 (Key #4)","P / S    (Key #5)","RATE OF PAY (Hourly Rate)","INCOME LEVEL      (Key #6)","RACIAL CAT. (Key #7)","ETHNIC CAT. (Key #8)","Misc"]
[null,null,null,null,null,null,null,null,null,null,null,{"$f":"$C$5&\" \"&$C$7","v":" "},{"$f":"$C$9","v":0},{"$f":"$C$11","v":0},{"$f":"$C$13","v":0},{"$f":"$C$15","v":"00:00:00"},null,{"$f":"$C$17","v":0},{"$f":"$C$23/40","v":0},{"$f":"$C$20","v":0},{"$f":"$C$25","v":0},{"$f":"$C$27","v":0},{"$f":"$C$30","v":0},{"$f":"$C$33","v":0},{"$f":"$C$36","v":0}]
[null,"Last Name",null,null,null,null,null,null,null,null,null,"Nick Rich","Log Peeler","Laborers (Unskilled)","Replace Terminated Staff Member",41096,null,"Part Time",0.5,"Seasonal",25,"Moderate","Black or Aftican American and White","Hispanic or Latino","Male"]
[]
[null,"Position Description"]
[]
[null,"Job Code"]
[]
[null,"Hire Status",null,"       <= Please ensure entry complies with instructions."]
[]
[null,"Date Hired (MM/DD/YYYY)"]
[]
[null,"Full or Part Time"]
[]
[]
[null,"Permanent / Seasonal"]
[]
[]
[null,"Hours worked per Week",null,"Check Full Time / Part time status vs. Hours per Week."]
[]
[null,"Rate of Pay (Hourly)"]
[]
[null,"Income Levels"]
[]
[]
[null,"Racial Category"]
[]
[]
[null,"Ethnic Category"]
[]
[]
[null,"Misc"]

{"sheet":"Modify Employees","index":4,"n_rows":40,"n_cols":11,"rows_kept":40,"cut":false,"hidden":false,"merged":[]}
["Montana Department of Commerce"]
["CDBG-ED Employment Tracking Form"]
["Employee Modification Sheet",null,null,null,null,{"$f":"IF(ISERROR(OR(F11,F13,F15,F17,F19,F21,F24,F27,F29,F31,F34,F37,F40)),\"Stop Process\",\"Proceed\")","v":"Stop Process"},null,null,{"$f":"IF(ISERROR(OR(I9,I10,I11,I12,I13,I14,I15,I16,I17,I18,I19,I20,I21,I22)),\"Stop Process\",\"Proceed\")","v":"Proceed"},null,{"$f":"IF(AND(F3=\"Proceed\",I3=\"Proceed\"),\"FALSE\",\"Stop Process\")","v":"Stop Process"}]
[]
[null,null,"Use this form when adusting an employees existing record.",null,null,3]
[]
[null,null,"Use the drop down box when available."]
[]
[null,"Employee",null,null,null,{"$f":"Employee_ToModify","v":0},null,null,{"$f":"Employee_ToModify","v":0}]
[null,null,null,null,null,null,null,null,{"$f":"C11","v":0}]
[null,"Position Description",null,null,null,{"$f":"VLOOKUP($C$9,'Employment Tracking Form'!$A$12:$N$5999,2,FALSE)","v":{"$error":"#N/A"}},null,null,{"$f":"C13","v":0}]
[null,null,null,null,null,null,null,null,{"$f":"C15","v":0}]
[null,"Job Code",null,null,null,{"$f":"VLOOKUP($C$9,'Employment Tracking Form'!$A$12:$N$5999,3,FALSE)","v":{"$error":"#N/A"}},null,null,{"$f":"C17","v":"00:00:00"}]
[null,null,null,null,null,null,null,null,{"$f":"IF(C19=\"\",\"\",C19)","v":""}]
[null,"Hire Status",null,null,null,{"$f":"VLOOKUP($C$9,'Employment Tracking Form'!$A$12:$N$5999,4,FALSE)","v":{"$error":"#N/A"}},null,null,{"$f":"C21","v":0}]
[null,null,null,null,null,null,null,null,{"$f":"C27/40","v":0}]
[null,"Date Hired (MM/DD/YYYY)",null,null,null,{"$f":"VLOOKUP($C$9,'Employment Tracking Form'!$A$12:$N$5999,5,FALSE)","v":{"$error":"#N/A"}},null,null,{"$f":"C24","v":0}]
[null,null,null,null,null,null,null,null,{"$f":"C29","v":0}]
[null,"Date Terminated (MM/DD/YYYY)",null,null,null,{"$f":"IF(VLOOKUP($C$9,'Employment Tracking Form'!$A$12:$N$5999,6,FALSE)=\"\",\"\",VLOOKUP($C$9,'Employment Tracking Form'!$A$12:$N$5999,6,FALSE))","v":{"$error":"#N/A"}},null,null,{"$f":"C31","v":0}]
[null,null,null,null,null,null,null,null,{"$f":"C34","v":0}]
[null,"Full or Part Time",null,null,null,{"$f":"VLOOKUP($C$9,'Employment Tracking Form'!$A$12:$N$5999,7,FALSE)","v":{"$error":"#N/A"}},null,null,{"$f":"C37","v":0}]
[null,null,null,null,null,null,null,null,{"$f":"C40","v":0}]
[]
[null,"Permanent / Seasonal",null,null,null,{"$f":"VLOOKUP($C$9,'Employment Tracking Form'!$A$12:$N$5999,9,FALSE)","v":{"$error":"#N/A"}}]
[]
[]
[null,"Hours worked per Week",null,"Please review Full or Part Time status and hour assigned.",null,{"$f":"VLOOKUP($C$9,'Employment Tracking Form'!$A$12:$N$5999,8,FALSE)*40","v":{"$error":"#N/A"}}]
[]
[null,"Rate of Pay (Hourly)",null,null,null,{"$f":"VLOOKUP($C$9,'Employment Tracking Form'!$A$12:$N$5999,10,FALSE)","v":{"$error":"#N/A"}}]
[]
[null,"Income Level",null,null,null,{"$f":"VLOOKUP($C$9,'Employment Tracking Form'!$A$12:$N$5999,11,FALSE)","v":{"$error":"#N/A"}}]
[]
[]
[null,"Racial Category",null,null,null,{"$f":"VLOOKUP($C$9,'Employment Tracking Form'!$A$12:$N$5999,12,FALSE)","v":{"$error":"#N/A"}}]
[]
[]
[null,"Ethnic Category",null,null,null,{"$f":"VLOOKUP($C$9,'Employment Tracking Form'!$A$12:$N$5999,13,FALSE)","v":{"$error":"#N/A"}}]
[]
[]
[null,"Misc.",null,null,null,{"$f":"VLOOKUP($C$9,'Employment Tracking Form'!$A$12:$N$5999,14,FALSE)","v":{"$error":"#N/A"}}]

{"sheet":"Employment Tracking Form","index":5,"n_rows":5998,"n_cols":29,"rows_kept":5998,"cut":false,"hidden":false,"merged":[[5997,13,5998,13],[5988,13,5989,13],[5996,9,5996,12],[5994,9,5994,12],[5995,9,5995,10],[3,1,3,3],[4,1,4,3],[5,1,5,3],[5989,3,5989,4],[6,1,6,3],[5990,7,5990,8],[5993,7,5993,8],[5992,9,5992,12],[5988,7,5989,8],[5988,5,5988,6],[5997,3,5997,6],[5988,9,5988,12],[5990,5,5990,6],[5989,5,5989,6],[8,1,8,3],[5988,3,5988,4],[5997,9,5998,12],[5988,1,5989,2],[5990,1,5990,2],[5991,1,5991,2],[5990,3,5990,4],[5991,9,5991,11],[5992,1,5992,2],[5996,3,5996,6],[5994,3,5994,6],[5995,3,5995,6]]}
["EMPLOYMENT TRACKING & DIRECT BENEFIT SUMMARY DATA"]
[]
["DATE OF AWARD",{"$f":"'Main Form'!B6","v":"00:00:00"}]
["NAME OF LOCAL GOVERNMENT: ",{"$f":"'Main Form'!B7","v":0},null,null,"Starting Staffing Level",null,{"$f":"'Main Form'!B13","v":0},"Starting LMI Staffing Level",null,{"$f":"'Main Form'!B14","v":0},"Starting LMI %",{"$f":"IF(G4=0,0,J4/G4)","v":0}]
["NAME OF ASSISTED ENTITY/BUSINESS:",{"$f":"'Main Form'!B8","v":0},null,null,"Current Staffing Level",null,{"$f":"(SUM(H12:H1550)-SUMIF(F12:F1550,\">0\",(H12:H1550)))","v":0},"LMI Staffing Level",null,{"$f":"SUM(O12:O1550)","v":0},"%LMI",{"$f":"IF(G5=0,0,J5/G5)","v":0}]
["DUNS NUMBER FOR BUSINESS :",{"$f":"'Main Form'!B9","v":0},null,null,"Total Hires to Date",null,{"$f":"SUM(Q12:Q1550)","v":0},"LMI Hires To Date",null,{"$f":"SUM(P12:P1550)","v":0}]
["NAIC CODE:",{"$f":"'Main Form'!B10","v":0},null,null,"Total  Retained to Date:",null,{"$f":"IF(G5>G4,G4,G5-G4)","v":0},"LMI Retained to Date",null,{"$f":"J5-J4","v":0}]
["PROVIDE HEALTH CARE BENEFITS:",{"$f":"'Main Form'!B11","v":0},null,null,"PAYROLL VERIFIED BY: "]
["CDBG CONTRACT #:  ",{"$f":"'Main Form'!B12","v":0},null,null,"DATE:","2011-07-01",null,null,"Count of Staff"," "]
[null,null,null,null,null,null,null,{"$f":"SUBTOTAL(9,H12:H4998)","v":0},"Sum of FTE %",null,null,null,null,null,null,0,"",0,0,0,0,0,0,0,0,{"$error":"#N/A"},{"$error":"#N/A"},{"$error":"#N/A"},{"$error":"#N/A"}]
["EMPLOYEE NAME",null,"JOB CODE (Key #1)","HIRE STATUS (Key #2)","DATE HIRED","DATE TERMINATED","FT / PT (Key #3)","FTE %              ie. .5, .75, 1.0 (Key #4)","P / S    (Key #5)","RATE OF PAY (Hourly Rate)","INCOME LEVEL      (Key #6)","RACIAL CAT. (Key #7)","ETHNIC CAT. (Key #8)","Misc Key # 9","LMI Currently Staffed","LMI Hired","Total Hires"]
[null,null,null,null,null,null,null,null,null,null,null,null,null,null,{"$f":"H12*IF(AND(F12=\"\",OR(K12=\"Low\",K12=\"Moderate\",K12=\"Extremely Low\")),1,0)","v":0},{"$f":"IF(AND(F12=\"\",OR(K12=\"Low\",K12=\"Moderate\",K12=\"Extremely Low\"),E12>$B$3),1,0)","v":0},{"$f":"IF(AND(F12=\"\",E12>$B$3),1,0)","v":0}]
[null,null,null,null,null,null,null,null,null,null,null,null,null,null,0,0,0]
[null,null,null,null,null,null,null,null,null,null,null,null,null,null,0,0,0]
[null,null,null,null,null,null,null,null,null,null,null,null,null,null,0,0,0]
[null,null,null,null,null,null,null,null,null,null,null,null,null,null,0,0,0]
[null,null,null,null,null,null,null,null,null,null,null,null,null,null,0,0,0]
[null,null,null,null,null,null,null,null,null,null,null,null,null,null,0,0,0]
[null,null,null,null,null,null,null,null,null,null,null,null,null,null,0,0,0]
[null,null,null,null,null,null,null,null,null,null,null,null,null,null,0,0,0]
[null,null,null,null,null,null,null,null,null,null,null,null,null,null,0,0,0]
[null,null,null,null,null,null,null,null,null,null,null,null,null,null,0,0,0]
[null,null,null,null,null,null,null,null,null,null,null,null,null,null,0,0,0]
[null,null,null,null,null,null,null,null,null,null,null,null,null,null,0,0,0]
[null,null,null,null,null,null,null,null,null,null,null,null,null,null,0,0,0]
[null,null,null,null,null,null,null,null,null,null,null,null,null,null,0,0,0]
[null,null,null,null,null,null,null,null,null,null,null,null,null,null,0,0,0]
[null,null,null,null,null,null,null,null,null,null,null,null,null,null,0,0,0]
[null,null,null,null,null,null,null,null,null,null,null,null,null,null,0,0,0]
[null,null,null,null,null,null,null,null,null,null,null,null,null,null,0,0,0]
[null,null,null,null,null,null,null,null,null,null,null,null,null,null,0,0,0]
[null,null,null,null,null,null,null,null,null,null,null,null,null,null,0,0,0]
[null,null,null,null,null,null,null,null,null,null,null,null,null,null,0,0,0]
[null,null,null,null,null,null,null,null,null,null,null,null,null,null,0,0,0]
[null,null,null,null,null,null,null,null,null,null,null,null,null,null,0,0,0]
[null,null,null,null,null,null,null,null,null,null,null,null,null,null,0,0,0]
[null,null,null,null,null,null,null,null,null,null,null,null,null,null,0,0,0]
[null,null,null,null,null,null,null,null,null,null,null,null,null,null,0,0,0]
[null,null,null,null,null,null,null,null,null,null,null,null,null,null,0,0,0]
[null,null,null,null,null,null,null,null,null,null,null,null,null,null,0,0,0]
[null,null,null,null,null,null,null,null,null,null,null,null,null,null,0,0,0]
[null,null,null,null,null,null,null,null,null,null,null,null,null,null,0,0,0]
[null,null,null,null,null,null,null,null,null,null,null,null,null,null,0,0,0]
[null,null,null,null,null,null,null,null,null,null,null,null,null,null,0,0,0]
[null,null,null,null,null,null,null,null,null,null,null,null,null,null,0,0,0]
[null,null,null,null,null,null,null,null,null,null,null,null,null,null,0,0,0]
[null,null,null,null,null,null,null,null,null,null,null,null,null,null,0,0,0]
[null,null,null,null,null,null,null,null,null,null,null,null,null,null,0,0,0]
[null,null,null,null,null,null,null,null,null,null,null,null,null,null,0,0,0]
[null,null,null,null,null,null,null,null,null,null,null,null,null,null,0,0,0]
[null,null,null,null,null,null,null,null,null,null,null,null,null,null,0,0,0]
[null,null,null,null,null,null,null,null,null,null,null,null,null,null,0,0,0]
[null,null,null,null,null,null,null,null,null,null,null,null,null,null,0,0,0]
[null,null,null,null,null,null,null,null,null,null,null,null,null,null,0,0,0]
[null,null,null,null,null,null,null,null,null,null,null,null,null,null,0,0,0]
[null,null,null,null,null,null,null,null,null,null,null,null,null,null,0,0,0]
[null,null,null,null,null,null,null,null,null,null,null,null,null,null,0,0,0]
[null,null,null,null,null,null,null,null,null,null,null,null,null,null,0,0,0]
[null,null,null,null,null,null,null,null,null,null,null,null,null,null,0,0,0]
[null,null,null,null,null,null,null,null,null,null,null,null,null,null,0,0,0]
[null,null,null,null,null,null,null,null,null,null,null,null,null,null,0,0,0]
[null,null,null,null,null,null,null,null,null,null,null,null,null,null,0,0,0]
[null,null,null,null,null,null,null,null,null,null,null,null,null,null,0,0,0]
[null,null,null,null,null,null,null,null,null,null,null,null,null,null,0,0,0]
[null,null,null,null,null,null,null,null,null,null,null,null,null,null,0,0,0]
[null,null,null,null,null,null,null,null,null,null,null,null,null,null,0,0,0]
[null,null,null,null,null,null,null,null,null,null,null,null,null,null,0,0,0]
[null,null,null,null,null,null,null,null,null,null,null,null,null,null,0,0,0]
[null,null,null,null,null,null,null,null,null,null,null,null,null,null,0,0,0]
[null,null,null,null,null,null,null,null,null,null,null,null,null,null,0,0,0]
[null,null,null,null,null,null,null,null,null,null,null,null,null,null,0,0,0]
[null,null,null,null,null,null,null,null,null,null,null,null,null,null,0,0,0]
[null,null,null,null,null,null,null,null,null,null,null,null,null,null,0,0,0]
[null,null,null,null,null,null,null,null,null,null,null,null,null,null,0,0,0]
[null,null,null,null,null,null,null,null,null,null,null,null,null,null,{"$f":"H75*IF(AND(F75=\"\",OR(K75=\"Low\",K75=\"Moderate\",K75=\"Extremely Low\")),1,0)","v":0},{"$f":"IF(AND(F75=\"\",OR(K75=\"Low\",K75=\"Moderate\",K75=\"Extremely Low\"),E75>$B$3),1,0)","v":0},{"$f":"IF(AND(F75=\"\",E75>$B$3),1,0)","v":0}]
[null,null,null,null,null,null,null,null,null,null,null,null,null,null,0,0,0]
[null,null,null,null,null,null,null,null,null,null,null,null,null,null,0,0,0]
[null,null,null,null,null,null,null,null,null,null,null,null,null,null,0,0,0]
[null,null,null,null,null,null,null,null,null,null,null,null,null,null,0,0,0]
[null,null,null,null,null,null,null,null,null,null,null,null,null,null,0,0,0]
[null,null,null,null,null,null,null,null,null,null,null,null,null,null,0,0,0]
[null,null,null,null,null,null,null,null,null,null,null,null,null,null,0,0,0]
[null,null,null,null,null,null,null,null,null,null,null,null,null,null,0,0,0]
[null,null,null,null,null,null,null,null,null,null,null,null,null,null,0,0,0]
[null,null,null,null,null,null,null,null,null,null,null,null,null,null,0,0,0]
[null,null,null,null,null,null,null,null,null,null,null,null,null,null,0,0,0]
[null,null,null,null,null,null,null,null,null,null,null,null,null,null,0,0,0]
[null,null,null,null,null,null,null,null,null,null,null,null,null,null,0,0,0]
[null,null,null,null,null,null,null,null,null,null,null,null,null,null,0,0,0]
[null,null,null,null,null,null,null,null,null,null,null,null,null,null,0,0,0]
[null,null,null,null,null,null,null,null,null,null,null,null,null,null,0,0,0]
[null,null,null,null,null,null,null,null,null,null,null,null,null,null,0,0,0]
[null,null,null,null,null,null,null,null,null,null,null,null,null,null,0,0,0]
[null,null,null,null,null,null,null,null,null,null,null,null,null,null,0,0,0]
[null,null,null,null,null,null,null,null,null,null,null,null,null,null,0,0,0]
[null,null,null,null,null,null,null,null,null,null,null,null,null,null,0,0,0]
[null,null,null,null,null,null,null,null,null,null,null,null,null,null,0,0,0]
[null,null,null,null,null,null,null,null,null,null,null,null,null,null,0,0,0]
[null,null,null,null,null,null,null,null,null,null,null,null,null,null,0,0,0]
[null,null,null,null,null,null,null,null,null,null,null,null,null,null,0,0,0]
[null,null,null,null,null,null,null,null,null,null,null,null,null,null,0,0,0]
[null,null,null,null,null,null,null,null,null,null,null,null,null,null,0,0,0]
[null,null,null,null,null,null,null,null,null,null,null,null,null,null,0,0,0]
[null,null,null,null,null,null,null,null,null,null,null,null,null,null,0,0,0]
[null,null,null,null,null,null,null,null,null,null,null,null,null,null,0,0,0]
[null,null,null,null,null,null,null,null,null,null,null,null,null,null,0,0,0]
[null,null,null,null,null,null,null,null,null,null,null,null,null,null,0,0,0]
[null,null,null,null,null,null,null,null,null,null,null,null,null,null,0,0,0]
[null,null,null,null,null,null,null,null,null,null,null,null,null,null,0,0,0]
[null,null,null,null,null,null,null,null,null,null,null,null,null,null,0,0,0]
[null,null,null,null,null,null,null,null,null,null,null,null,null,null,0,0,0]
[null,null,null,null,null,null,null,null,null,null,null,null,null,null,0,0,0]
[null,null,null,null,null,null,null,null,null,null,null,null,null,null,0,0,0]
[null,null,null,null,null,null,null,null,null,null,null,null,null,null,0,0,0]
[null,null,null,null,null,null,null,null,null,null,null,null,null,null,0,0,0]
[null,null,null,null,null,null,null,null,null,null,null,null,null,null,0,0,0]
[null,null,null,null,null,null,null,null,null,null,null,null,null,null,0,0,0]
[null,null,null,null,null,null,null,null,null,null,null,null,null,null,0,0,0]
[null,null,null,null,null,null,null,null,null,null,null,null,null,null,0,0,0]
[null,null,null,null,null,null,null,null,null,null,null,null,null,null,0,0,0]
{"$rows_left_out":5879}
{"sheet":"Ranges","index":6,"n_rows":57,"n_cols":3,"rows_kept":57,"cut":false,"hidden":true,"merged":[]}
[]
[]
[]
[null,"Hire_Status"]
[null,"FTE In Training","Train"]
[null,"New Position","NP"]
[null,"Replace Terminated Staff Member","REP"]
[null,"Retained Staff","RET"]
[]
[null,"Full Time or Part Time"]
[null,"Full Time","FT"]
[null,"Part Time","PT"]
[]
[]
[null,"Permanent","P"]
[null,"Seasonal","S"]
[]
[null,"Income Levels"]
[null,"Extremely Low","EL"]
[null,"Low","L"]
[null,"Moderate","M"]
[null,"Not Low/Moderate","NL"]
[null,"Did Not Answer","DNA"]
[]
[null,"Racial Category"]
[null,"American Indian or Alaska Native",1]
[null,"Asian",2]
[null,"Black or African American",3]
[null,"Native Hawaiian or Other Pacific Islander",4]
[null,"White",5]
[null,"American Indian or Alaska Native and White",6]
[null,"Asian and White",7]
[null,"Black or Aftican American and White",8]
[null,"American Indian or Alaska Native and Black or African American",9]
[null,"Did Not Answer","DNA"]
[]
[null,"Hispanic or Latino","Y"]
[null,"Not Hispanic or Latino","N"]
[null,"Did Not Answer","DNA"]
[]
[null,"Misc"]
[null,"Male","M"]
[null,"Female","F"]
[null,"Handicapped","H"]
[null,"Female Head of Household","FHH"]
[null,"Did Not Answer","DNA"]
[]
[null,"Job Codes"]
[null,"Officials and Managers","A"]
[null,"Professional","B"]
[null,"Technicians","C"]
[null,"Sales","D"]
[null,"Office and Clerical","E"]
[null,"Craft Workers (Skilled)","F"]
[null,"Operatives (Semi-Skilled)","G"]
[null,"Laborers (Unskilled)","H"]
[null,"Service Workers","I"]

{"sheet":"Sheet1","index":7,"n_rows":0,"n_cols":0,"rows_kept":0,"cut":false,"hidden":false,"merged":[]}